<html>
<head>
<meta http-equiv="Content-Type" content="text/html; charset=iso-8859-1">
<style type="text/css" style="display:none;"><!-- P {margin-top:0;margin-bottom:0;} --></style>
</head>
<body dir="ltr">
<div id="divtagdefaultwrapper" style="font-size:12pt;color:#000000;background-color:#FFFFFF;font-family:Calibri,Arial,Helvetica,sans-serif;">
<p>Hi,</p>
<p><br>
</p>
<p>I have a problem with the installation for developing in JdeRobot. When I run make, I get:
<br>
</p>
<p><br>
</p>
<p>/home/vanejessi/JdeRobot/src/stable/components/ardrone_server/src/interfaces/pose3di.cpp: In constructor ‘pose3D::Pose3DI::Pose3DI(ARDroneDriver*)’:<br>
/home/vanejessi/JdeRobot/src/stable/components/ardrone_server/src/interfaces/pose3di.cpp:68:16: error: no match for ‘operator=’ in ‘((pose3D::Pose3DI*)this)->pose3D::Pose3DI::xyzT = {0, 0, 0}’<br>
/home/vanejessi/JdeRobot/src/stable/components/ardrone_server/src/interfaces/pose3di.cpp:68:16: note: candidate is:<br>
/home/vanejessi/JdeRobot/src/stable/components/ardrone_server/include/ardrone_server/interfaces/pose3di.h:31:17: note: pose3D::pose3d& pose3D::pose3d::operator=(const pose3D::pose3d&)<br>
/home/vanejessi/JdeRobot/src/stable/components/ardrone_server/include/ardrone_server/interfaces/pose3di.h:31:17: note: no known conversion for argument 1 from ‘<brace-enclosed initializer list>’ to ‘const pose3D::pose3d&’<br>
make[2]: *** [src/stable/components/ardrone_server/CMakeFiles/ardrone_server.dir/src/interfaces/pose3di.cpp.o] Error 1<br>
make[1]: *** [src/stable/components/ardrone_server/CMakeFiles/ardrone_server.dir/all] Error 2<br>
make: *** [all] Error 2<br>
</p>
<p><br>
</p>
<p>What is the problem?</p>
<p><br>
</p>
<p>Thanks!!</p>
<p><br>
</p>
<p>Jessi<br>
</p>
</div>
</body>
</html>